Установка Cool Reader на LMDE 3 Cindy Mate

Офисные пакеты, текстовые и табличные процессоры и т.д.
Правила форума
Как правильно задавать вопросы Правильно сформулированный вопрос и его грамотное оформление способствует высокой вероятности получения достаточно содержательного и по существу ответа. Общая рекомендация по составлению тем: 1. Версия ОС вместе с разрядностью. Пример: LM 18.1 x64, LM Sarah x32 2. DE. Если вопрос касается двух, то через запятую. (xfce, KDE, cinnamon, mate) 3. Какое железо. (достаточно вывод inxi -Fxz в спойлере (как пользоваться спойлером смотрим здесь)) или же дать ссылку на hw-probe 4. Суть. Желательно с выводом консоли, логами. 5. Скрин. Просьба указывать 1, 2 и 3 независимо от того, имеет ли это отношение к вопросу или нет. Так же не забываем об общих правилах Как пример вот
Аватара пользователя

Автор темы
hellonet
Сообщения: 1044
Зарегистрирован: 11 окт 2016, 09:58
Решено: 3
Откуда: Новосибирск
Благодарил (а): 341 раз
Поблагодарили: 131 раз

Установка Cool Reader на LMDE 3 Cindy Mate

Сообщение hellonet » 20 сен 2018, 02:56

Попытался установить читалку CR3 на LMDE 3 Cindy Mate By Chokobo.
Bсё брал с сайта http://zenway.ru/page/coolreader-3
Делал в терминале так:
1. sudo apt install git
2. sudo apt install cmake
3. git clone git://crengine.git.sourceforge.net/gitroot/crengine/crengine
4. Зашел в home/crengine и создал там папку qtbuild
5. Зашел в папку qtbuild и в ней в терминале выполнил cmake -D GUI=QT -D CMAKE_BUILD_TYPE=Release -D CMAKE_INSTALL_PREFIX=/opt/coolreader/ ..
make
sudo make install

Выхлоп терминала прилагаю в скриншоте:
Что делать?

Решение darkfenix » 20 сен 2018, 05:14
hellonet, Сейчас залез на https://github.com/buggins/coolreader и нашел там кое-что интересное по сборке. А именно, что перед сборкой необходимо установить следующее

Код: Выделить всё

sudo apt-get install libqt4-dev libfreetype6-dev libfontconfig1-dev
Возможно для LMDE/Debian пакет имеет другое название. Сейчас нет под рукой LMDE чтоб проверить, делаю на LM19
И уже потом производить сборку и установку.
1.

Код: Выделить всё

git clone git://crengine.git.sourceforge.net/gitroot/crengine/crengine
cd crengine
mkdir qtbuild
cd qtbuild
cmake -D GUI=QT -D CMAKE_BUILD_TYPE=Release  -D CMAKE_INSTALL_PREFIX=/opt/coolreader/ ..
Если все прошло без ошибок. В конце должны быть такие строчки

Код: Выделить всё

-- Configuring done
-- Generating done
-- Build files have been written to: /home/darkfenix/crengine/qtbuild
Тогда далее.
2. Должно дойти до 100%

Код: Выделить всё

[ 98%] Building CXX object cr3qt/CMakeFiles/cr3.dir/src/moc_exportprogressdlg.cxx.o
[ 99%] Building CXX object cr3qt/CMakeFiles/cr3.dir/src/moc_tocdlg.cxx.o
[100%] Building CXX object cr3qt/CMakeFiles/cr3.dir/src/moc_searchdlg.cxx.o
[100%] Linking CXX executable cr3
[100%] Built target cr3
3. Можно сделать

Код: Выделить всё

sudo make install
4. Запуск

Код: Выделить всё

/opt/coolreader/bin/cr3

Перейти к ответу ➙
У вас нет необходимых прав для просмотра вложений в этом сообщении.

Аватара пользователя

darkfenix
Сообщения: 5606
Зарегистрирован: 27 июн 2017, 10:36
Решено: 62
Откуда: Нижний Тагил
Благодарил (а): 309 раз
Поблагодарили: 1038 раз

Установка Cool Reader на LMDE 3 Cindy Mate

Сообщение darkfenix » 20 сен 2018, 04:20

hellonet, у тебя cmake с ошибка закончился, поэтому остальные команды не отработали.
Сделай cat /home/h/crengine/qtbuild/CMakeFiles/CMakeOutput.log | pastebin и ссылку сюда выложи.
Изображение

Аватара пользователя

WWolf
Сообщения: 1412
Зарегистрирован: 13 фев 2018, 21:51
Решено: 5
Откуда: Краснодар
Благодарил (а): 482 раза
Поблагодарили: 327 раз

Установка Cool Reader на LMDE 3 Cindy Mate

Сообщение WWolf » 20 сен 2018, 04:57

hellonet, qt поставь то

Аватара пользователя

Автор темы
hellonet
Сообщения: 1044
Зарегистрирован: 11 окт 2016, 09:58
Решено: 3
Откуда: Новосибирск
Благодарил (а): 341 раз
Поблагодарили: 131 раз

Установка Cool Reader на LMDE 3 Cindy Mate

Сообщение hellonet » 20 сен 2018, 05:13

darkfenix писал(а):
20 сен 2018, 04:20
Сделай cat /home/h/crengine/qtbuild/CMakeFiles/CMakeOutput.log | pastebin и ссылку сюда выложи.
/usr/bin/cmake -E cmake_link_script CMakeFiles/cmTC_b1395.dir/link.txt --verbose=1
/usr/bin/cc CMakeFiles/cmTC_b1395.dir/feature_tests.c.o -o cmTC_b1395 -rdynamic
make[1]: выход из каталога «/home/h/crengine/qtbuild/CMakeFiles/CMakeTmp»


Feature record: C_FEATURE:1c_function_prototypes
Feature record: C_FEATURE:1c_restrict
Feature record: C_FEATURE:1c_static_assert
Feature record: C_FEATURE:1c_variadic_macros


Detecting C [-std=c99] compiler features compiled with the following output:
Change Dir: /home/h/crengine/qtbuild/CMakeFiles/CMakeTmp

Run Build Command:"/usr/bin/make" "cmTC_d06ca/fast"
/usr/bin/make -f CMakeFiles/cmTC_d06ca.dir/build.make CMakeFiles/cmTC_d06ca.dir/build
make[1]: вход в каталог «/home/h/crengine/qtbuild/CMakeFiles/CMakeTmp»
Building C object CMakeFiles/cmTC_d06ca.dir/feature_tests.c.o
/usr/bin/cc -std=c99 -o CMakeFiles/cmTC_d06ca.dir/feature_tests.c.o -c /home/h/crengine/qtbuild/CMakeFiles/feature_tests.c
Linking C executable cmTC_d06ca
/usr/bin/cmake -E cmake_link_script CMakeFiles/cmTC_d06ca.dir/link.txt --verbose=1
/usr/bin/cc CMakeFiles/cmTC_d06ca.dir/feature_tests.c.o -o cmTC_d06ca -rdynamic
make[1]: выход из каталога «/home/h/crengine/qtbuild/CMakeFiles/CMakeTmp»


Feature record: C_FEATURE:1c_function_prototypes
Feature record: C_FEATURE:1c_restrict
Feature record: C_FEATURE:0c_static_assert
Feature record: C_FEATURE:1c_variadic_macros


Detecting C [-std=c90] compiler features compiled with the following output:
Change Dir: /home/h/crengine/qtbuild/CMakeFiles/CMakeTmp

Run Build Command:"/usr/bin/make" "cmTC_c14a2/fast"
/usr/bin/make -f CMakeFiles/cmTC_c14a2.dir/build.make CMakeFiles/cmTC_c14a2.dir/build
make[1]: вход в каталог «/home/h/crengine/qtbuild/CMakeFiles/CMakeTmp»
Building C object CMakeFiles/cmTC_c14a2.dir/feature_tests.c.o
/usr/bin/cc -std=c90 -o CMakeFiles/cmTC_c14a2.dir/feature_tests.c.o -c /home/h/crengine/qtbuild/CMakeFiles/feature_tests.c
Linking C executable cmTC_c14a2
/usr/bin/cmake -E cmake_link_script CMakeFiles/cmTC_c14a2.dir/link.txt --verbose=1
/usr/bin/cc CMakeFiles/cmTC_c14a2.dir/feature_tests.c.o -o cmTC_c14a2 -rdynamic
make[1]: выход из каталога «/home/h/crengine/qtbuild/CMakeFiles/CMakeTmp»


Feature record: C_FEATURE:1c_function_prototypes
Feature record: C_FEATURE:0c_restrict
Feature record: C_FEATURE:0c_static_assert
Feature record: C_FEATURE:0c_variadic_macros
Determining if the CXX compiler works passed with the following output:
Change Dir: /home/h/crengine/qtbuild/CMakeFiles/CMakeTmp

Run Build Command:"/usr/bin/make" "cmTC_c0e04/fast"
/usr/bin/make -f CMakeFiles/cmTC_c0e04.dir/build.make CMakeFiles/cmTC_c0e04.dir/build
make[1]: вход в каталог «/home/h/crengine/qtbuild/CMakeFiles/CMakeTmp»
Building CXX object CMakeFiles/cmTC_c0e04.dir/testCXXCompiler.cxx.o
/usr/bin/c++ -o CMakeFiles/cmTC_c0e04.dir/testCXXCompiler.cxx.o -c /home/h/crengine/qtbuild/CMakeFiles/CMakeTmp/testCXXCompiler.cxx
Linking CXX executable cmTC_c0e04
/usr/bin/cmake -E cmake_link_script CMakeFiles/cmTC_c0e04.dir/link.txt --verbose=1
/usr/bin/c++ CMakeFiles/cmTC_c0e04.dir/testCXXCompiler.cxx.o -o cmTC_c0e04 -rdynamic
make[1]: выход из каталога «/home/h/crengine/qtbuild/CMakeFiles/CMakeTmp»


Detecting CXX compiler ABI info compiled with the following output:
Change Dir: /home/h/crengine/qtbuild/CMakeFiles/CMakeTmp

Run Build Command:"/usr/bin/make" "cmTC_67c8b/fast"
/usr/bin/make -f CMakeFiles/cmTC_67c8b.dir/build.make CMakeFiles/cmTC_67c8b.dir/build
make[1]: вход в каталог «/home/h/crengine/qtbuild/CMakeFiles/CMakeTmp»
Building CXX object CMakeFiles/cmTC_67c8b.dir/CMakeCXXCompilerABI.cpp.o
/usr/bin/c++ -o CMakeFiles/cmTC_67c8b.dir/CMakeCXXCompilerABI.cpp.o -c /usr/share/cmake-3.7/Modules/CMakeCXXCompilerABI.cpp
Linking CXX executable cmTC_67c8b
/usr/bin/cmake -E cmake_link_script CMakeFiles/cmTC_67c8b.dir/link.txt --verbose=1
/usr/bin/c++ -v CMakeFiles/cmTC_67c8b.dir/CMakeCXXCompilerABI.cpp.o -o cmTC_67c8b -rdynamic
Using built-in specs.
COLLECT_GCC=/usr/bin/c++
COLLECT_LTO_WRAPPER=/usr/lib/gcc/x86_64-linux-gnu/6/lto-wrapper
Target: x86_64-linux-gnu
Configured with: ../src/configure -v --with-pkgversion='Debian 6.3.0-18+deb9u1' --with-bugurl=file:///usr/share/doc/gcc-6/README.Bugs --enable-languages=c,ada,c++,java,go,d,fortran,objc,obj-c++ --prefix=/usr --program-suffix=-6 --program-prefix=x86_64-linux-gnu- --enable-shared --enable-linker-build-id --libexecdir=/usr/lib --without-included-gettext --enable-threads=posix --libdir=/usr/lib --enable-nls --with-sysroot=/ --enable-clocale=gnu --enable-libstdcxx-debug --enable-libstdcxx-time=yes --with-default-libstdcxx-abi=new --enable-gnu-unique-object --disable-vtable-verify --enable-libmpx --enable-plugin --enable-default-pie --with-system-zlib --disable-browser-plugin --enable-java-awt=gtk --enable-gtk-cairo --with-java-home=/usr/lib/jvm/java-1.5.0-gcj-6-amd64/jre --enable-java-home --with-jvm-root-dir=/usr/lib/jvm/java-1.5.0-gcj-6-amd64 --with-jvm-jar-dir=/usr/lib/jvm-exports/java-1.5.0-gcj-6-amd64 --with-arch-directory=amd64 --with-ecj-jar=/usr/share/java/eclipse-ecj.jar --with-target-system-zlib --enable-objc-gc=auto --enable-multiarch --with-arch-32=i686 --with-abi=m64 --with-multilib-list=m32,m64,mx32 --enable-multilib --with-tune=generic --enable-checking=release --build=x86_64-linux-gnu --host=x86_64-linux-gnu --target=x86_64-linux-gnu
Thread model: posix
gcc version 6.3.0 20170516 (Debian 6.3.0-18+deb9u1)
COMPILER_PATH=/usr/lib/gcc/x86_64-linux-gnu/6/:/usr/lib/gcc/x86_64-linux-gnu/6/:/usr/lib/gcc/x86_64-linux-gnu/:/usr/lib/gcc/x86_64-linux-gnu/6/:/usr/lib/gcc/x86_64-linux-gnu/
LIBRARY_PATH=/usr/lib/gcc/x86_64-linux-gnu/6/:/usr/lib/gcc/x86_64-linux-gnu/6/../../../x86_64-linux-gnu/:/usr/lib/gcc/x86_64-linux-gnu/6/../../../../lib/:/lib/x86_64-linux-gnu/:/lib/../lib/:/usr/lib/x86_64-linux-gnu/:/usr/lib/../lib/:/usr/lib/gcc/x86_64-linux-gnu/6/../../../:/lib/:/usr/lib/
COLLECT_GCC_OPTIONS='-v' '-o' 'cmTC_67c8b' '-rdynamic' '-shared-libgcc' '-mtune=generic' '-march=x86-64'
/usr/lib/gcc/x86_64-linux-gnu/6/collect2 -plugin /usr/lib/gcc/x86_64-linux-gnu/6/liblto_plugin.so -plugin-opt=/usr/lib/gcc/x86_64-linux-gnu/6/lto-wrapper -plugin-opt=-fresolution=/tmp/cc14HquI.res -plugin-opt=-pass-through=-lgcc_s -plugin-opt=-pass-through=-lgcc -plugin-opt=-pass-through=-lc -plugin-opt=-pass-through=-lgcc_s -plugin-opt=-pass-through=-lgcc --sysroot=/ --build-id --eh-frame-hdr -m elf_x86_64 --hash-style=gnu -export-dynamic -dynamic-linker /lib64/ld-linux-x86-64.so.2 -pie -o cmTC_67c8b /usr/lib/gcc/x86_64-linux-gnu/6/../../../x86_64-linux-gnu/Scrt1.o /usr/lib/gcc/x86_64-linux-gnu/6/../../../x86_64-linux-gnu/crti.o /usr/lib/gcc/x86_64-linux-gnu/6/crtbeginS.o -L/usr/lib/gcc/x86_64-linux-gnu/6 -L/usr/lib/gcc/x86_64-linux-gnu/6/../../../x86_64-linux-gnu -L/usr/lib/gcc/x86_64-linux-gnu/6/../../../../lib -L/lib/x86_64-linux-gnu -L/lib/../lib -L/usr/lib/x86_64-linux-gnu -L/usr/lib/../lib -L/usr/lib/gcc/x86_64-linux-gnu/6/../../.. CMakeFiles/cmTC_67c8b.dir/CMakeCXXCompilerABI.cpp.o -lstdc++ -lm -lgcc_s -lgcc -lc -lgcc_s -lgcc /usr/lib/gcc/x86_64-linux-gnu/6/crtendS.o /usr/lib/gcc/x86_64-linux-gnu/6/../../../x86_64-linux-gnu/crtn.o
COLLECT_GCC_OPTIONS='-v' '-o' 'cmTC_67c8b' '-rdynamic' '-shared-libgcc' '-mtune=generic' '-march=x86-64'
make[1]: выход из каталога «/home/h/crengine/qtbuild/CMakeFiles/CMakeTmp»


Parsed CXX implicit link information from above output:
link line regex: [^( *|.*[/\])(ld|([^/\]+-)?ld|collect2)[^/\]*( |$)]
ignore line: [Change Dir: /home/h/crengine/qtbuild/CMakeFiles/CMakeTmp]
ignore line: []
ignore line: [Run Build Command:"/usr/bin/make" "cmTC_67c8b/fast"]
ignore line: [/usr/bin/make -f CMakeFiles/cmTC_67c8b.dir/build.make CMakeFiles/cmTC_67c8b.dir/build]
ignore line: [make[1]: вход в каталог «/home/h/crengine/qtbuild/CMakeFiles/CMakeTmp»]
ignore line: [Building CXX object CMakeFiles/cmTC_67c8b.dir/CMakeCXXCompilerABI.cpp.o]
ignore line: [/usr/bin/c++ -o CMakeFiles/cmTC_67c8b.dir/CMakeCXXCompilerABI.cpp.o -c /usr/share/cmake-3.7/Modules/CMakeCXXCompilerABI.cpp]
ignore line: [Linking CXX executable cmTC_67c8b]
ignore line: [/usr/bin/cmake -E cmake_link_script CMakeFiles/cmTC_67c8b.dir/link.txt --verbose=1]
ignore line: [/usr/bin/c++ -v CMakeFiles/cmTC_67c8b.dir/CMakeCXXCompilerABI.cpp.o -o cmTC_67c8b -rdynamic ]
ignore line: [Using built-in specs.]
ignore line: [COLLECT_GCC=/usr/bin/c++]
ignore line: [COLLECT_LTO_WRAPPER=/usr/lib/gcc/x86_64-linux-gnu/6/lto-wrapper]
ignore line: [Target: x86_64-linux-gnu]
ignore line: [Configured with: ../src/configure -v --with-pkgversion='Debian 6.3.0-18+deb9u1' --with-bugurl=file:///usr/share/doc/gcc-6/README.Bugs --enable-languages=c,ada,c++,java,go,d,fortran,objc,obj-c++ --prefix=/usr --program-suffix=-6 --program-prefix=x86_64-linux-gnu- --enable-shared --enable-linker-build-id --libexecdir=/usr/lib --without-included-gettext --enable-threads=posix --libdir=/usr/lib --enable-nls --with-sysroot=/ --enable-clocale=gnu --enable-libstdcxx-debug --enable-libstdcxx-time=yes --with-default-libstdcxx-abi=new --enable-gnu-unique-object --disable-vtable-verify --enable-libmpx --enable-plugin --enable-default-pie --with-system-zlib --disable-browser-plugin --enable-java-awt=gtk --enable-gtk-cairo --with-java-home=/usr/lib/jvm/java-1.5.0-gcj-6-amd64/jre --enable-java-home --with-jvm-root-dir=/usr/lib/jvm/java-1.5.0-gcj-6-amd64 --with-jvm-jar-dir=/usr/lib/jvm-exports/java-1.5.0-gcj-6-amd64 --with-arch-directory=amd64 --with-ecj-jar=/usr/share/java/eclipse-ecj.jar --with-target-system-zlib --enable-objc-gc=auto --enable-multiarch --with-arch-32=i686 --with-abi=m64 --with-multilib-list=m32,m64,mx32 --enable-multilib --with-tune=generic --enable-checking=release --build=x86_64-linux-gnu --host=x86_64-linux-gnu --target=x86_64-linux-gnu]
ignore line: [Thread model: posix]
ignore line: [gcc version 6.3.0 20170516 (Debian 6.3.0-18+deb9u1) ]
ignore line: [COMPILER_PATH=/usr/lib/gcc/x86_64-linux-gnu/6/:/usr/lib/gcc/x86_64-linux-gnu/6/:/usr/lib/gcc/x86_64-linux-gnu/:/usr/lib/gcc/x86_64-linux-gnu/6/:/usr/lib/gcc/x86_64-linux-gnu/]
ignore line: [LIBRARY_PATH=/usr/lib/gcc/x86_64-linux-gnu/6/:/usr/lib/gcc/x86_64-linux-gnu/6/../../../x86_64-linux-gnu/:/usr/lib/gcc/x86_64-linux-gnu/6/../../../../lib/:/lib/x86_64-linux-gnu/:/lib/../lib/:/usr/lib/x86_64-linux-gnu/:/usr/lib/../lib/:/usr/lib/gcc/x86_64-linux-gnu/6/../../../:/lib/:/usr/lib/]
ignore line: [COLLECT_GCC_OPTIONS='-v' '-o' 'cmTC_67c8b' '-rdynamic' '-shared-libgcc' '-mtune=generic' '-march=x86-64']
link line: [ /usr/lib/gcc/x86_64-linux-gnu/6/collect2 -plugin /usr/lib/gcc/x86_64-linux-gnu/6/liblto_plugin.so -plugin-opt=/usr/lib/gcc/x86_64-linux-gnu/6/lto-wrapper -plugin-opt=-fresolution=/tmp/cc14HquI.res -plugin-opt=-pass-through=-lgcc_s -plugin-opt=-pass-through=-lgcc -plugin-opt=-pass-through=-lc -plugin-opt=-pass-through=-lgcc_s -plugin-opt=-pass-through=-lgcc --sysroot=/ --build-id --eh-frame-hdr -m elf_x86_64 --hash-style=gnu -export-dynamic -dynamic-linker /lib64/ld-linux-x86-64.so.2 -pie -o cmTC_67c8b /usr/lib/gcc/x86_64-linux-gnu/6/../../../x86_64-linux-gnu/Scrt1.o /usr/lib/gcc/x86_64-linux-gnu/6/../../../x86_64-linux-gnu/crti.o /usr/lib/gcc/x86_64-linux-gnu/6/crtbeginS.o -L/usr/lib/gcc/x86_64-linux-gnu/6 -L/usr/lib/gcc/x86_64-linux-gnu/6/../../../x86_64-linux-gnu -L/usr/lib/gcc/x86_64-linux-gnu/6/../../../../lib -L/lib/x86_64-linux-gnu -L/lib/../lib -L/usr/lib/x86_64-linux-gnu -L/usr/lib/../lib -L/usr/lib/gcc/x86_64-linux-gnu/6/../../.. CMakeFiles/cmTC_67c8b.dir/CMakeCXXCompilerABI.cpp.o -lstdc++ -lm -lgcc_s -lgcc -lc -lgcc_s -lgcc /usr/lib/gcc/x86_64-linux-gnu/6/crtendS.o /usr/lib/gcc/x86_64-linux-gnu/6/../../../x86_64-linux-gnu/crtn.o]
arg [/usr/lib/gcc/x86_64-linux-gnu/6/collect2] ==> ignore
arg [-plugin] ==> ignore
arg [/usr/lib/gcc/x86_64-linux-gnu/6/liblto_plugin.so] ==> ignore
arg [-plugin-opt=/usr/lib/gcc/x86_64-linux-gnu/6/lto-wrapper] ==> ignore
arg [-plugin-opt=-fresolution=/tmp/cc14HquI.res] ==> ignore
arg [-plugin-opt=-pass-through=-lgcc_s] ==> ignore
arg [-plugin-opt=-pass-through=-lgcc] ==> ignore
arg [-plugin-opt=-pass-through=-lc] ==> ignore
arg [-plugin-opt=-pass-through=-lgcc_s] ==> ignore
arg [-plugin-opt=-pass-through=-lgcc] ==> ignore
arg [--sysroot=/] ==> ignore
arg [--build-id] ==> ignore
arg [--eh-frame-hdr] ==> ignore
arg [-m] ==> ignore
arg [elf_x86_64] ==> ignore
arg [--hash-style=gnu] ==> ignore
arg [-export-dynamic] ==> ignore
arg [-dynamic-linker] ==> ignore
arg [/lib64/ld-linux-x86-64.so.2] ==> ignore
arg [-pie] ==> ignore
arg [-o] ==> ignore
arg [cmTC_67c8b] ==> ignore
arg [/usr/lib/gcc/x86_64-linux-gnu/6/../../../x86_64-linux-gnu/Scrt1.o] ==> ignore
arg [/usr/lib/gcc/x86_64-linux-gnu/6/../../../x86_64-linux-gnu/crti.o] ==> ignore
arg [/usr/lib/gcc/x86_64-linux-gnu/6/crtbeginS.o] ==> ignore
arg [-L/usr/lib/gcc/x86_64-linux-gnu/6] ==> dir [/usr/lib/gcc/x86_64-linux-gnu/6]
arg [-L/usr/lib/gcc/x86_64-linux-gnu/6/../../../x86_64-linux-gnu] ==> dir [/usr/lib/gcc/x86_64-linux-gnu/6/../../../x86_64-linux-gnu]
arg [-L/usr/lib/gcc/x86_64-linux-gnu/6/../../../../lib] ==> dir [/usr/lib/gcc/x86_64-linux-gnu/6/../../../../lib]
arg [-L/lib/x86_64-linux-gnu] ==> dir [/lib/x86_64-linux-gnu]
arg [-L/lib/../lib] ==> dir [/lib/../lib]
arg [-L/usr/lib/x86_64-linux-gnu] ==> dir [/usr/lib/x86_64-linux-gnu]
arg [-L/usr/lib/../lib] ==> dir [/usr/lib/../lib]
arg [-L/usr/lib/gcc/x86_64-linux-gnu/6/../../..] ==> dir [/usr/lib/gcc/x86_64-linux-gnu/6/../../..]
arg [CMakeFiles/cmTC_67c8b.dir/CMakeCXXCompilerABI.cpp.o] ==> ignore
arg [-lstdc++] ==> lib [stdc++]
arg [-lm] ==> lib [m]
arg [-lgcc_s] ==> lib [gcc_s]
arg [-lgcc] ==> lib [gcc]
arg [-lc] ==> lib [c]
arg [-lgcc_s] ==> lib [gcc_s]
arg [-lgcc] ==> lib [gcc]
arg [/usr/lib/gcc/x86_64-linux-gnu/6/crtendS.o] ==> ignore
arg [/usr/lib/gcc/x86_64-linux-gnu/6/../../../x86_64-linux-gnu/crtn.o] ==> ignore
remove lib [gcc_s]
remove lib [gcc]
remove lib [gcc_s]
remove lib [gcc]
collapse library dir [/usr/lib/gcc/x86_64-linux-gnu/6] ==> [/usr/lib/gcc/x86_64-linux-gnu/6]
collapse library dir [/usr/lib/gcc/x86_64-linux-gnu/6/../../../x86_64-linux-gnu] ==> [/usr/lib/x86_64-linux-gnu]
collapse library dir [/usr/lib/gcc/x86_64-linux-gnu/6/../../../../lib] ==> [/usr/lib]
collapse library dir [/lib/x86_64-linux-gnu] ==> [/lib/x86_64-linux-gnu]
collapse library dir [/lib/../lib] ==> [/lib]
collapse library dir [/usr/lib/x86_64-linux-gnu] ==> [/usr/lib/x86_64-linux-gnu]
collapse library dir [/usr/lib/../lib] ==> [/usr/lib]
collapse library dir [/usr/lib/gcc/x86_64-linux-gnu/6/../../..] ==> [/usr/lib]
implicit libs: [stdc++;m;c]
implicit dirs: [/usr/lib/gcc/x86_64-linux-gnu/6;/usr/lib/x86_64-linux-gnu;/usr/lib;/lib/x86_64-linux-gnu;/lib]
implicit fwks: []




Detecting CXX [-std=c++14] compiler features compiled with the following output:
Change Dir: /home/h/crengine/qtbuild/CMakeFiles/CMakeTmp

Run Build Command:"/usr/bin/make" "cmTC_d6c68/fast"
/usr/bin/make -f CMakeFiles/cmTC_d6c68.dir/build.make CMakeFiles/cmTC_d6c68.dir/build
make[1]: вход в каталог «/home/h/crengine/qtbuild/CMakeFiles/CMakeTmp»
Building CXX object CMakeFiles/cmTC_d6c68.dir/feature_tests.cxx.o
/usr/bin/c++ -std=c++14 -o CMakeFiles/cmTC_d6c68.dir/feature_tests.cxx.o -c /home/h/crengine/qtbuild/CMakeFiles/feature_tests.cxx
Linking CXX executable cmTC_d6c68
/usr/bin/cmake -E cmake_link_script CMakeFiles/cmTC_d6c68.dir/link.txt --verbose=1
/usr/bin/c++ CMakeFiles/cmTC_d6c68.dir/feature_tests.cxx.o -o cmTC_d6c68 -rdynamic
make[1]: выход из каталога «/home/h/crengine/qtbuild/CMakeFiles/CMakeTmp»


Feature record: CXX_FEATURE:1cxx_aggregate_default_initializers
Feature record: CXX_FEATURE:1cxx_alias_templates
Feature record: CXX_FEATURE:1cxx_alignas
Feature record: CXX_FEATURE:1cxx_alignof
Feature record: CXX_FEATURE:1cxx_attributes
Feature record: CXX_FEATURE:1cxx_attribute_deprecated
Feature record: CXX_FEATURE:1cxx_auto_type
Feature record: CXX_FEATURE:1cxx_binary_literals
Feature record: CXX_FEATURE:1cxx_constexpr
Feature record: CXX_FEATURE:1cxx_contextual_conversions
Feature record: CXX_FEATURE:1cxx_decltype
Feature record: CXX_FEATURE:1cxx_decltype_auto
Feature record: CXX_FEATURE:1cxx_decltype_incomplete_return_types
Feature record: CXX_FEATURE:1cxx_default_function_template_args
Feature record: CXX_FEATURE:1cxx_defaulted_functions
Feature record: CXX_FEATURE:1cxx_defaulted_move_initializers
Feature record: CXX_FEATURE:1cxx_delegating_constructors
Feature record: CXX_FEATURE:1cxx_deleted_functions
Feature record: CXX_FEATURE:1cxx_digit_separators
Feature record: CXX_FEATURE:1cxx_enum_forward_declarations
Feature record: CXX_FEATURE:1cxx_explicit_conversions
Feature record: CXX_FEATURE:1cxx_extended_friend_declarations
Feature record: CXX_FEATURE:1cxx_extern_templates
Feature record: CXX_FEATURE:1cxx_final
Feature record: CXX_FEATURE:1cxx_func_identifier
Feature record: CXX_FEATURE:1cxx_generalized_initializers
Feature record: CXX_FEATURE:1cxx_generic_lambdas
Feature record: CXX_FEATURE:1cxx_inheriting_constructors
Feature record: CXX_FEATURE:1cxx_inline_namespaces
Feature record: CXX_FEATURE:1cxx_lambdas
Feature record: CXX_FEATURE:1cxx_lambda_init_captures
Feature record: CXX_FEATURE:1cxx_local_type_template_args
Feature record: CXX_FEATURE:1cxx_long_long_type
Feature record: CXX_FEATURE:1cxx_noexcept
Feature record: CXX_FEATURE:1cxx_nonstatic_member_init
Feature record: CXX_FEATURE:1cxx_nullptr
Feature record: CXX_FEATURE:1cxx_override
Feature record: CXX_FEATURE:1cxx_range_for
Feature record: CXX_FEATURE:1cxx_raw_string_literals
Feature record: CXX_FEATURE:1cxx_reference_qualified_functions
Feature record: CXX_FEATURE:1cxx_relaxed_constexpr
Feature record: CXX_FEATURE:1cxx_return_type_deduction
Feature record: CXX_FEATURE:1cxx_right_angle_brackets
Feature record: CXX_FEATURE:1cxx_rvalue_references
Feature record: CXX_FEATURE:1cxx_sizeof_member
Feature record: CXX_FEATURE:1cxx_static_assert
Feature record: CXX_FEATURE:1cxx_strong_enums
Feature record: CXX_FEATURE:1cxx_template_template_parameters
Feature record: CXX_FEATURE:1cxx_thread_local
Feature record: CXX_FEATURE:1cxx_trailing_return_types
Feature record: CXX_FEATURE:1cxx_unicode_literals
Feature record: CXX_FEATURE:1cxx_uniform_initialization
Feature record: CXX_FEATURE:1cxx_unrestricted_unions
Feature record: CXX_FEATURE:1cxx_user_literals
Feature record: CXX_FEATURE:1cxx_variable_templates
Feature record: CXX_FEATURE:1cxx_variadic_macros
Feature record: CXX_FEATURE:1cxx_variadic_templates


Detecting CXX [-std=c++11] compiler features compiled with the following output:
Change Dir: /home/h/crengine/qtbuild/CMakeFiles/CMakeTmp

Run Build Command:"/usr/bin/make" "cmTC_26302/fast"
/usr/bin/make -f CMakeFiles/cmTC_26302.dir/build.make CMakeFiles/cmTC_26302.dir/build
make[1]: вход в каталог «/home/h/crengine/qtbuild/CMakeFiles/CMakeTmp»
Building CXX object CMakeFiles/cmTC_26302.dir/feature_tests.cxx.o
/usr/bin/c++ -std=c++11 -o CMakeFiles/cmTC_26302.dir/feature_tests.cxx.o -c /home/h/crengine/qtbuild/CMakeFiles/feature_tests.cxx
Linking CXX executable cmTC_26302
/usr/bin/cmake -E cmake_link_script CMakeFiles/cmTC_26302.dir/link.txt --verbose=1
/usr/bin/c++ CMakeFiles/cmTC_26302.dir/feature_tests.cxx.o -o cmTC_26302 -rdynamic
make[1]: выход из каталога «/home/h/crengine/qtbuild/CMakeFiles/CMakeTmp»


Feature record: CXX_FEATURE:0cxx_aggregate_default_initializers
Feature record: CXX_FEATURE:1cxx_alias_templates
Feature record: CXX_FEATURE:1cxx_alignas
Feature record: CXX_FEATURE:1cxx_alignof
Feature record: CXX_FEATURE:1cxx_attributes
Feature record: CXX_FEATURE:0cxx_attribute_deprecated
Feature record: CXX_FEATURE:1cxx_auto_type
Feature record: CXX_FEATURE:0cxx_binary_literals
Feature record: CXX_FEATURE:1cxx_constexpr
Feature record: CXX_FEATURE:0cxx_contextual_conversions
Feature record: CXX_FEATURE:1cxx_decltype
Feature record: CXX_FEATURE:0cxx_decltype_auto
Feature record: CXX_FEATURE:1cxx_decltype_incomplete_return_types
Feature record: CXX_FEATURE:1cxx_default_function_template_args
Feature record: CXX_FEATURE:1cxx_defaulted_functions
Feature record: CXX_FEATURE:1cxx_defaulted_move_initializers
Feature record: CXX_FEATURE:1cxx_delegating_constructors
Feature record: CXX_FEATURE:1cxx_deleted_functions
Feature record: CXX_FEATURE:0cxx_digit_separators
Feature record: CXX_FEATURE:1cxx_enum_forward_declarations
Feature record: CXX_FEATURE:1cxx_explicit_conversions
Feature record: CXX_FEATURE:1cxx_extended_friend_declarations
Feature record: CXX_FEATURE:1cxx_extern_templates
Feature record: CXX_FEATURE:1cxx_final
Feature record: CXX_FEATURE:1cxx_func_identifier
Feature record: CXX_FEATURE:1cxx_generalized_initializers
Feature record: CXX_FEATURE:0cxx_generic_lambdas
Feature record: CXX_FEATURE:1cxx_inheriting_constructors
Feature record: CXX_FEATURE:1cxx_inline_namespaces
Feature record: CXX_FEATURE:1cxx_lambdas
Feature record: CXX_FEATURE:0cxx_lambda_init_captures
Feature record: CXX_FEATURE:1cxx_local_type_template_args
Feature record: CXX_FEATURE:1cxx_long_long_type
Feature record: CXX_FEATURE:1cxx_noexcept
Feature record: CXX_FEATURE:1cxx_nonstatic_member_init
Feature record: CXX_FEATURE:1cxx_nullptr
Feature record: CXX_FEATURE:1cxx_override
Feature record: CXX_FEATURE:1cxx_range_for
Feature record: CXX_FEATURE:1cxx_raw_string_literals
Feature record: CXX_FEATURE:1cxx_reference_qualified_functions
Feature record: CXX_FEATURE:0cxx_relaxed_constexpr
Feature record: CXX_FEATURE:0cxx_return_type_deduction
Feature record: CXX_FEATURE:1cxx_right_angle_brackets
Feature record: CXX_FEATURE:1cxx_rvalue_references
Feature record: CXX_FEATURE:1cxx_sizeof_member
Feature record: CXX_FEATURE:1cxx_static_assert
Feature record: CXX_FEATURE:1cxx_strong_enums
Feature record: CXX_FEATURE:1cxx_template_template_parameters
Feature record: CXX_FEATURE:1cxx_thread_local
Feature record: CXX_FEATURE:1cxx_trailing_return_types
Feature record: CXX_FEATURE:1cxx_unicode_literals
Feature record: CXX_FEATURE:1cxx_uniform_initialization
Feature record: CXX_FEATURE:1cxx_unrestricted_unions
Feature record: CXX_FEATURE:1cxx_user_literals
Feature record: CXX_FEATURE:0cxx_variable_templates
Feature record: CXX_FEATURE:1cxx_variadic_macros
Feature record: CXX_FEATURE:1cxx_variadic_templates


Detecting CXX [-std=c++98] compiler features compiled with the following output:
Change Dir: /home/h/crengine/qtbuild/CMakeFiles/CMakeTmp

Run Build Command:"/usr/bin/make" "cmTC_8411f/fast"
/usr/bin/make -f CMakeFiles/cmTC_8411f.dir/build.make CMakeFiles/cmTC_8411f.dir/build
make[1]: вход в каталог «/home/h/crengine/qtbuild/CMakeFiles/CMakeTmp»
Building CXX object CMakeFiles/cmTC_8411f.dir/feature_tests.cxx.o
/usr/bin/c++ -std=c++98 -o CMakeFiles/cmTC_8411f.dir/feature_tests.cxx.o -c /home/h/crengine/qtbuild/CMakeFiles/feature_tests.cxx
Linking CXX executable cmTC_8411f
/usr/bin/cmake -E cmake_link_script CMakeFiles/cmTC_8411f.dir/link.txt --verbose=1
/usr/bin/c++ CMakeFiles/cmTC_8411f.dir/feature_tests.cxx.o -o cmTC_8411f -rdynamic
make[1]: выход из каталога «/home/h/crengine/qtbuild/CMakeFiles/CMakeTmp»


Feature record: CXX_FEATURE:0cxx_aggregate_default_initializers
Feature record: CXX_FEATURE:0cxx_alias_templates
Feature record: CXX_FEATURE:0cxx_alignas
Feature record: CXX_FEATURE:0cxx_alignof
Feature record: CXX_FEATURE:0cxx_attributes
Feature record: CXX_FEATURE:0cxx_attribute_deprecated
Feature record: CXX_FEATURE:0cxx_auto_type
Feature record: CXX_FEATURE:0cxx_binary_literals
Feature record: CXX_FEATURE:0cxx_constexpr
Feature record: CXX_FEATURE:0cxx_contextual_conversions
Feature record: CXX_FEATURE:0cxx_decltype
Feature record: CXX_FEATURE:0cxx_decltype_auto
Feature record: CXX_FEATURE:0cxx_decltype_incomplete_return_types
Feature record: CXX_FEATURE:0cxx_default_function_template_args
Feature record: CXX_FEATURE:0cxx_defaulted_functions
Feature record: CXX_FEATURE:0cxx_defaulted_move_initializers
Feature record: CXX_FEATURE:0cxx_delegating_constructors
Feature record: CXX_FEATURE:0cxx_deleted_functions
Feature record: CXX_FEATURE:0cxx_digit_separators
Feature record: CXX_FEATURE:0cxx_enum_forward_declarations
Feature record: CXX_FEATURE:0cxx_explicit_conversions
Feature record: CXX_FEATURE:0cxx_extended_friend_declarations
Feature record: CXX_FEATURE:0cxx_extern_templates
Feature record: CXX_FEATURE:0cxx_final
Feature record: CXX_FEATURE:0cxx_func_identifier
Feature record: CXX_FEATURE:0cxx_generalized_initializers
Feature record: CXX_FEATURE:0cxx_generic_lambdas
Feature record: CXX_FEATURE:0cxx_inheriting_constructors
Feature record: CXX_FEATURE:0cxx_inline_namespaces
Feature record: CXX_FEATURE:0cxx_lambdas
Feature record: CXX_FEATURE:0cxx_lambda_init_captures
Feature record: CXX_FEATURE:0cxx_local_type_template_args
Feature record: CXX_FEATURE:0cxx_long_long_type
Feature record: CXX_FEATURE:0cxx_noexcept
Feature record: CXX_FEATURE:0cxx_nonstatic_member_init
Feature record: CXX_FEATURE:0cxx_nullptr
Feature record: CXX_FEATURE:0cxx_override
Feature record: CXX_FEATURE:0cxx_range_for
Feature record: CXX_FEATURE:0cxx_raw_string_literals
Feature record: CXX_FEATURE:0cxx_reference_qualified_functions
Feature record: CXX_FEATURE:0cxx_relaxed_constexpr
Feature record: CXX_FEATURE:0cxx_return_type_deduction
Feature record: CXX_FEATURE:0cxx_right_angle_brackets
Feature record: CXX_FEATURE:0cxx_rvalue_references
Feature record: CXX_FEATURE:0cxx_sizeof_member
Feature record: CXX_FEATURE:0cxx_static_assert
Feature record: CXX_FEATURE:0cxx_strong_enums
Feature record: CXX_FEATURE:1cxx_template_template_parameters
Feature record: CXX_FEATURE:0cxx_thread_local
Feature record: CXX_FEATURE:0cxx_trailing_return_types
Feature record: CXX_FEATURE:0cxx_unicode_literals
Feature record: CXX_FEATURE:0cxx_uniform_initialization
Feature record: CXX_FEATURE:0cxx_unrestricted_unions
Feature record: CXX_FEATURE:0cxx_user_literals
Feature record: CXX_FEATURE:0cxx_variable_templates
Feature record: CXX_FEATURE:0cxx_variadic_macros
Feature record: CXX_FEATURE:0cxx_variadic_templates
h@h:~$

Аватара пользователя

darkfenix
Сообщения: 5606
Зарегистрирован: 27 июн 2017, 10:36
Решено: 62
Откуда: Нижний Тагил
Благодарил (а): 309 раз
Поблагодарили: 1038 раз

Установка Cool Reader на LMDE 3 Cindy Mate

Сообщение darkfenix » 20 сен 2018, 05:14

hellonet, Сейчас залез на https://github.com/buggins/coolreader и нашел там кое-что интересное по сборке. А именно, что перед сборкой необходимо установить следующее

Код: Выделить всё

sudo apt-get install libqt4-dev libfreetype6-dev libfontconfig1-dev
Возможно для LMDE/Debian пакет имеет другое название. Сейчас нет под рукой LMDE чтоб проверить, делаю на LM19
И уже потом производить сборку и установку.
1.

Код: Выделить всё

git clone git://crengine.git.sourceforge.net/gitroot/crengine/crengine
cd crengine
mkdir qtbuild
cd qtbuild
cmake -D GUI=QT -D CMAKE_BUILD_TYPE=Release  -D CMAKE_INSTALL_PREFIX=/opt/coolreader/ ..
Если все прошло без ошибок. В конце должны быть такие строчки

Код: Выделить всё

-- Configuring done
-- Generating done
-- Build files have been written to: /home/darkfenix/crengine/qtbuild
Тогда далее.
2. Должно дойти до 100%

Код: Выделить всё

[ 98%] Building CXX object cr3qt/CMakeFiles/cr3.dir/src/moc_exportprogressdlg.cxx.o
[ 99%] Building CXX object cr3qt/CMakeFiles/cr3.dir/src/moc_tocdlg.cxx.o
[100%] Building CXX object cr3qt/CMakeFiles/cr3.dir/src/moc_searchdlg.cxx.o
[100%] Linking CXX executable cr3
[100%] Built target cr3
3. Можно сделать

Код: Выделить всё

sudo make install
4. Запуск

Код: Выделить всё

/opt/coolreader/bin/cr3
Изображение

Аватара пользователя

Автор темы
hellonet
Сообщения: 1044
Зарегистрирован: 11 окт 2016, 09:58
Решено: 3
Откуда: Новосибирск
Благодарил (а): 341 раз
Поблагодарили: 131 раз

Установка Cool Reader на LMDE 3 Cindy Mate

Сообщение hellonet » 20 сен 2018, 05:16

WWolf писал(а):
20 сен 2018, 04:57
hellonet, qt поставь то
h@h:~$ sudo apt install qt
[sudo] пароль для h:
Чтение списков пакетов… Готово
Построение дерева зависимостей
Чтение информации о состоянии… Готово
E: Не удалось найти пакет qt
h@h:~$

Аватара пользователя

Автор темы
hellonet
Сообщения: 1044
Зарегистрирован: 11 окт 2016, 09:58
Решено: 3
Откуда: Новосибирск
Благодарил (а): 341 раз
Поблагодарили: 131 раз

Установка Cool Reader на LMDE 3 Cindy Mate

Сообщение hellonet » 20 сен 2018, 05:33

darkfenix писал(а):
20 сен 2018, 05:14
Если все прошло без ошибок. В конце должны быть такие строчки

КОД: ВЫДЕЛИТЬ ВСЁ

-- Configuring done
-- Generating done
-- Build files have been written to: /home/darkfenix/crengine/qtbuild
Не получилось. В конце так:
-- Looking for xlocale.h
-- Looking for xlocale.h - found
-- Could NOT find Freetype (missing: FREETYPE_LIBRARY)
CMake Error at thirdparty/harfbuzz/CMakeLists.txt:272 (message):
HB_HAVE_FREETYPE was set, but we failed to find it. Maybe add a
CMAKE_PREFIX_PATH= to your Freetype2 install prefix


-- Configuring incomplete, errors occurred!
See also "/home/h/crengine/qtbuild/crengine/qtbuild/CMakeFiles/CMakeOutput.log".
See also "/home/h/crengine/qtbuild/crengine/qtbuild/CMakeFiles/CMakeError.log".
h@h:~/crengine/qtbuild/crengine/qtbuild$

Аватара пользователя

Автор темы
hellonet
Сообщения: 1044
Зарегистрирован: 11 окт 2016, 09:58
Решено: 3
Откуда: Новосибирск
Благодарил (а): 341 раз
Поблагодарили: 131 раз

Установка Cool Reader на LMDE 3 Cindy Mate

Сообщение hellonet » 20 сен 2018, 05:36

darkfenix писал(а):
20 сен 2018, 05:14
hellonet, Сейчас залез на https://github.com/buggins/coolreader и нашел там кое-что интересное по сборке. А именно, что перед сборкой необходимо установить следующее
КОД: ВЫДЕЛИТЬ ВСЁ

sudo apt-get install libqt4-dev
Возможно для LMDE/Debian пакет имеет другое название. Сейчас нет под рукой LMDE чтоб проверить, делаю на LM19
И уже потом производить сборку и установку.
Название такое же

Аватара пользователя

darkfenix
Сообщения: 5606
Зарегистрирован: 27 июн 2017, 10:36
Решено: 62
Откуда: Нижний Тагил
Благодарил (а): 309 раз
Поблагодарили: 1038 раз

Установка Cool Reader на LMDE 3 Cindy Mate

Сообщение darkfenix » 20 сен 2018, 05:39

hellonet, ты что на столько ленив что самому гуглить никак?
hellonet писал(а):
20 сен 2018, 05:33
Could NOT find Freetype (missing: FREETYPE_LIBRARY)
Все же написано. Поставь sudo apt install libfreetype6 libfreetype6-dev
Изображение

Аватара пользователя

Автор темы
hellonet
Сообщения: 1044
Зарегистрирован: 11 окт 2016, 09:58
Решено: 3
Откуда: Новосибирск
Благодарил (а): 341 раз
Поблагодарили: 131 раз

Установка Cool Reader на LMDE 3 Cindy Mate

Сообщение hellonet » 20 сен 2018, 05:44

darkfenix писал(а):
20 сен 2018, 05:39
ты что на столько ленив что самому гуглить никак?
Да уже запутался, голова пухнет, не могу сообразить чего надо гуглить. Сейчас если не получится, то отдохну и начну сначала.

Аватара пользователя

WWolf
Сообщения: 1412
Зарегистрирован: 13 фев 2018, 21:51
Решено: 5
Откуда: Краснодар
Благодарил (а): 482 раза
Поблагодарили: 327 раз

Установка Cool Reader на LMDE 3 Cindy Mate

Сообщение WWolf » 20 сен 2018, 05:47

hellonet, просто почитай гитхаб, там все либы необходимые указаны

Аватара пользователя

Автор темы
hellonet
Сообщения: 1044
Зарегистрирован: 11 окт 2016, 09:58
Решено: 3
Откуда: Новосибирск
Благодарил (а): 341 раз
Поблагодарили: 131 раз

Установка Cool Reader на LMDE 3 Cindy Mate

Сообщение hellonet » 20 сен 2018, 05:49

darkfenix писал(а):
20 сен 2018, 05:14
Если все прошло без ошибок. В конце должны быть такие строчки
КОД: ВЫДЕЛИТЬ ВСЁ

-- Configuring done
-- Generating done
-- Build files have been written to: /home/darkfenix/crengine/qtbuild
Получилось!
-- Configuring done
-- Generating done
-- Build files have been written to: /home/h/crengine/qtbuild
h@h:~/crengine/qtbuild$

Аватара пользователя

Автор темы
hellonet
Сообщения: 1044
Зарегистрирован: 11 окт 2016, 09:58
Решено: 3
Откуда: Новосибирск
Благодарил (а): 341 раз
Поблагодарили: 131 раз

Установка Cool Reader на LMDE 3 Cindy Mate

Сообщение hellonet » 20 сен 2018, 05:55

darkfenix писал(а):
20 сен 2018, 05:14
ОД: ВЫДЕЛИТЬ ВСЁ

make
Должно дойти до 100%
КОД: ВЫДЕЛИТЬ ВСЁ

[ 98%] Building CXX object cr3qt/CMakeFiles/cr3.dir/src/moc_exportprogressdlg.cxx.o
[ 99%] Building CXX object cr3qt/CMakeFiles/cr3.dir/src/moc_tocdlg.cxx.o
[100%] Building CXX object cr3qt/CMakeFiles/cr3.dir/src/moc_searchdlg.cxx.o
[100%] Linking CXX executable cr3
[100%] Built target cr3
Дошло до 67% и выкинуло:
[ 66%] Building CXX object crengine/CMakeFiles/crengine.dir/src/hyphman.cpp.o
/home/h/crengine/crengine/src/hyphman.cpp: In member function ‘bool HyphDictionary::activate()’:
/home/h/crengine/crengine/src/hyphman.cpp:176:5: warning: this ‘if’ clause does not guard... [-Wmisleading-indentation]
if (HyphMan::_selectedDictionary == this)
^~
/home/h/crengine/crengine/src/hyphman.cpp:178:2: note: ...this statement, but the latter is misleadingly indented as if it is guarded by the ‘if’
if ( getType() == HDT_ALGORITHM ) {
^~
[ 67%] Building CXX object crengine/CMakeFiles/crengine.dir/src/lvfntman.cpp.o
/home/h/crengine/crengine/src/lvfntman.cpp:72:39: fatal error: fontconfig/fontconfig.h: Нет такого файла или каталога
#include <fontconfig/fontconfig.h>
^
compilation terminated.
crengine/CMakeFiles/crengine.dir/build.make:494: ошибка выполнения рецепта для цели «crengine/CMakeFiles/crengine.dir/src/lvfntman.cpp.o»
make[2]: *** [crengine/CMakeFiles/crengine.dir/src/lvfntman.cpp.o] Ошибка 1
CMakeFiles/Makefile2:672: ошибка выполнения рецепта для цели «crengine/CMakeFiles/crengine.dir/all»
make[1]: *** [crengine/CMakeFiles/crengine.dir/all] Ошибка 2
Makefile:149: ошибка выполнения рецепта для цели «all»
make: *** [all] Ошибка 2
h@h:~/crengine/qtbuild$

Аватара пользователя

darkfenix
Сообщения: 5606
Зарегистрирован: 27 июн 2017, 10:36
Решено: 62
Откуда: Нижний Тагил
Благодарил (а): 309 раз
Поблагодарили: 1038 раз

Установка Cool Reader на LMDE 3 Cindy Mate

Сообщение darkfenix » 20 сен 2018, 05:58

hellonet, sudo apt install libfontconfig1-dev и начни сначала, т.е. очисти папку qtbuild
Изображение

Аватара пользователя

Автор темы
hellonet
Сообщения: 1044
Зарегистрирован: 11 окт 2016, 09:58
Решено: 3
Откуда: Новосибирск
Благодарил (а): 341 раз
Поблагодарили: 131 раз

Установка Cool Reader на LMDE 3 Cindy Mate

Сообщение hellonet » 20 сен 2018, 06:09

darkfenix писал(а):
20 сен 2018, 05:14
Должно дойти до 100%
КОД: ВЫДЕЛИТЬ ВСЁ

[ 98%] Building CXX object cr3qt/CMakeFiles/cr3.dir/src/moc_exportprogressdlg.cxx.o
[ 99%] Building CXX object cr3qt/CMakeFiles/cr3.dir/src/moc_tocdlg.cxx.o
[100%] Building CXX object cr3qt/CMakeFiles/cr3.dir/src/moc_searchdlg.cxx.o
[100%] Linking CXX executable cr3
[100%] Built target cr3
И это получилось!

Аватара пользователя

Автор темы
hellonet
Сообщения: 1044
Зарегистрирован: 11 окт 2016, 09:58
Решено: 3
Откуда: Новосибирск
Благодарил (а): 341 раз
Поблагодарили: 131 раз

Установка Cool Reader на LMDE 3 Cindy Mate

Сообщение hellonet » 20 сен 2018, 06:10

darkfenix писал(а):
20 сен 2018, 05:14
3. Можно сделать
КОД: ВЫДЕЛИТЬ ВСЁ

sudo make install
Вот!
-- Installing: /opt/coolreader/share/cr3/i18n/cr3_bg.qm
-- Installing: /opt/coolreader/share/cr3/i18n/cr3_hu.qm
-- Installing: /opt/coolreader/share/applications/cr3.desktop
-- Installing: /opt/coolreader/share/pixmaps/cr3.png
-- Installing: /opt/coolreader/share/pixmaps/cr3.xpm
h@h:~/crengine/qtbuild$

Аватара пользователя

darkfenix
Сообщения: 5606
Зарегистрирован: 27 июн 2017, 10:36
Решено: 62
Откуда: Нижний Тагил
Благодарил (а): 309 раз
Поблагодарили: 1038 раз

Установка Cool Reader на LMDE 3 Cindy Mate

Сообщение darkfenix » 20 сен 2018, 06:13

hellonet, теперь осталось запустить /opt/coolreader/bin/cr3
Изображение


hiteke
Сообщения: 12
Зарегистрирован: 19 сен 2018, 10:15
Поблагодарили: 1 раз

Установка Cool Reader на LMDE 3 Cindy Mate

Сообщение hiteke » 20 сен 2018, 06:24

http://linuxthebest.zzz.com.ua/%D0%A7%D ... _amd64.deb
Или
sudo add-apt-repository ppa:vovansrnd/coolreader
sudo apt-get update
sudo apt-get install cr3

Аватара пользователя

Автор темы
hellonet
Сообщения: 1044
Зарегистрирован: 11 окт 2016, 09:58
Решено: 3
Откуда: Новосибирск
Благодарил (а): 341 раз
Поблагодарили: 131 раз

Установка Cool Reader на LMDE 3 Cindy Mate

Сообщение hellonet » 20 сен 2018, 06:44

hiteke писал(а):
20 сен 2018, 06:24
sudo add-apt-repository ppa:vovansrnd/coolreader
ppa репозитории LMDE 3 Cindy не поддерживает. Если бы всё было так просто, я бы тему не создавал.

Аватара пользователя

Автор темы
hellonet
Сообщения: 1044
Зарегистрирован: 11 окт 2016, 09:58
Решено: 3
Откуда: Новосибирск
Благодарил (а): 341 раз
Поблагодарили: 131 раз

Установка Cool Reader на LMDE 3 Cindy Mate

Сообщение hellonet » 20 сен 2018, 06:45

darkfenix писал(а):
20 сен 2018, 06:13
hellonet, теперь осталось запустить /opt/coolreader/bin/cr3
Всё заработало! Осталось добавить в меню и в список предпочитаемых приложений для открывания файлов fb2

Вернуться в «Офис и документы»